Target
Phosphatidylinositol 4,5-bisphosphate 3-kinase catalytic subunit delta isoform
Ligand
BDBM334118
Substrate
Meas. Tech.
Scintillation Proximity Assay
IC50
<10±n/a nM
Citation
 Li, YCombs, APYue, EWMei, SDouty, B Use of pyrazolopyrimidine derivatives for the treatment of PI3K-delta related disorders US Patent  US9932341 Publication Date 4/3/2018 
Target
Name:
Phosphatidylinositol 4,5-bisphosphate 3-kinase catalytic subunit delta isoform
Synonyms:
PI3-kinase p110 subunit delta PI3-kinase subunit p110-delta PIK3CD Phosphatidylinositol 4,5-biphosphate 3-kinase catalytic subunit delta (PIK3CD) Phosphatidylinositol 4,5-bisphosphate 3-kinase 110 kDa catalytic subunit delta (PI3K delta) Phosphatidylinositol 4,5-bisphosphate 3-kinase catalytic subunit delta (PI3Kdelta) Phosphatidylinositol 4,5-bisphosphate 3-kinase catalytic subunit delta isoform (PI3K delta) Phosphatidylinositol 4,5-bisphosphate 3-kinase catalytic subunit delta isoform (PI3K-delta) Phosphatidylinositol 4,5-bisphosphate 3-kinase catalytic subunit delta isoform (PI3Kdelta)
Type:
Enzyme Subunit
Mol. Mass.:
119489.41
Organism:
Homo sapiens (Human)
Description:
O00329
Residue:
1044
  
Inhibitor
Name:
BDBM334118
Synonyms:
Diastereoisomers of 4-[1-(4-amino-3-methyl-1H-pyrazolo[3,4-d]pyrimidin-1-yl)ethyl]-6-chloro-2-[1-(2-hydroxy-1-methylethyl)azetidin-3-yl]-3-methoxybenzonitrile US9932341, Example 273
Type:
Small organic molecule
Emp. Form.:
C22H26ClN7O2
Mol. Mass.:
455.941
SMILES:
COc1c(cc(Cl)c(C#N)c1C1CN(C1)C(C)CO)C(C)n1nc(C)c2c(N)ncnc12
: