Target
Phosphatidylinositol 4,5-bisphosphate 3-kinase catalytic subunit delta isoform
Ligand
BDBM261320
Substrate
Meas. Tech.
Scintillation Proximity Assay
IC50
<10±n/a nM
Citation
 Li, YCombs, APYue, EWMei, SDouty, B Use of pyrazolopyrimidine derivatives for the treatment of PI3K-delta related disorders US Patent  US9932341 Publication Date 4/3/2018 
Target
Name:
Phosphatidylinositol 4,5-bisphosphate 3-kinase catalytic subunit delta isoform
Synonyms:
PI3-kinase p110 subunit delta PI3-kinase subunit p110-delta PIK3CD Phosphatidylinositol 4,5-biphosphate 3-kinase catalytic subunit delta (PIK3CD) Phosphatidylinositol 4,5-bisphosphate 3-kinase 110 kDa catalytic subunit delta (PI3K delta) Phosphatidylinositol 4,5-bisphosphate 3-kinase catalytic subunit delta (PI3Kdelta) Phosphatidylinositol 4,5-bisphosphate 3-kinase catalytic subunit delta isoform (PI3K delta) Phosphatidylinositol 4,5-bisphosphate 3-kinase catalytic subunit delta isoform (PI3K-delta) Phosphatidylinositol 4,5-bisphosphate 3-kinase catalytic subunit delta isoform (PI3Kdelta)
Type:
Enzyme Subunit
Mol. Mass.:
119489.41
Organism:
Homo sapiens (Human)
Description:
O00329
Residue:
1044
  
Inhibitor
Name:
BDBM261320
Synonyms:
US10092570, Example 323 US9707233, 323 (3rd peak) US9730939, Example 323 | US9932341, Example 323
Type:
Small organic molecule
Emp. Form.:
C20H20ClN7O3
Mol. Mass.:
441.871
SMILES:
CCOc1c(cc(Cl)c(C#N)c1C1CNC(=O)O1)C(C)n1nc(C)c2c(N)ncnc12
: