Target
Phosphatidylinositol 4,5-bisphosphate 3-kinase catalytic subunit delta isoform
Ligand
BDBM272574
Substrate
Meas. Tech.
Scintillation Proximity Assay
IC50
125±n/a nM
Citation
 Li, YCombs, APYue, EWMei, SDouty, B Use of pyrazolopyrimidine derivatives for the treatment of PI3K-delta related disorders US Patent  US9932341 Publication Date 4/3/2018 
Target
Name:
Phosphatidylinositol 4,5-bisphosphate 3-kinase catalytic subunit delta isoform
Synonyms:
PI3-kinase p110 subunit delta PI3-kinase subunit p110-delta PIK3CD Phosphatidylinositol 4,5-biphosphate 3-kinase catalytic subunit delta (PIK3CD) Phosphatidylinositol 4,5-bisphosphate 3-kinase 110 kDa catalytic subunit delta (PI3K delta) Phosphatidylinositol 4,5-bisphosphate 3-kinase catalytic subunit delta (PI3Kdelta) Phosphatidylinositol 4,5-bisphosphate 3-kinase catalytic subunit delta isoform (PI3K delta) Phosphatidylinositol 4,5-bisphosphate 3-kinase catalytic subunit delta isoform (PI3K-delta) Phosphatidylinositol 4,5-bisphosphate 3-kinase catalytic subunit delta isoform (PI3Kdelta)
Type:
Enzyme Subunit
Mol. Mass.:
119489.41
Organism:
Homo sapiens (Human)
Description:
O00329
Residue:
1044
  
Inhibitor
Name:
BDBM272574
Synonyms:
US10065963, Compound 32d US10646492, Example 347 US9932341, Example 348
Type:
Small organic molecule
Emp. Form.:
C20H22ClFN6O2
Mol. Mass.:
432.879
SMILES:
CCOc1c(cc(Cl)c(F)c1[C@H]1CNC(=O)C1)[C@H](C)n1nc(C)c2c(N)ncnc12
: