Target
Interleukin-1 receptor-associated kinase 4
Ligand
BDBM384565
Substrate
Meas. Tech.
Kinase Assay
IC50
52.0±n/a nM
Citation
 Altman, MDBrubaker, JDChilders, MLDonofrio, AFischmann, TGibeau, CRKattar, SDLesburg, CALim, JMaclean, JKMansoor, UFNorthrup, ABSanders, JMSmith, GF Inhibitors of IRAK4 activity US Patent  US9932350 Publication Date 4/3/2018 
Target
Name:
Interleukin-1 receptor-associated kinase 4
Synonyms:
IRAK-4 IRAK4_HUMAN Interleukin-1 receptor-associated kinase 4 (IRAK4) | Renal carcinoma antigen NY-REN-64
Type:
Protein
Mol. Mass.:
51519.08
Organism:
Homo sapiens (Human)
Description:
Q9NWZ3
Residue:
460
  
Inhibitor
Name:
BDBM384565
Synonyms:
2-[(4-{[trans-4- (dimethylamino)cyclohexyl] amino}quinazolin-6- yl)oxy]acetamide | US9932350, 2-17
Type:
Small organic molecule
Emp. Form.:
C18H25N5O2
Mol. Mass.:
343.4234
SMILES:
CN(C)[C@H]1CC[C@@H](CC1)Nc1ncnc2ccc(OCC(N)=O)cc12
: