Target
Proto-oncogene Wnt-1
Ligand
BDBM384757
Substrate
Meas. Tech.
The screening assay for Wnt activity
EC50
>10000±n/a nM
Citation
 KC, SKWallace, DMCao, JChiruta, CHood, J 3-(1H-pyrrolo[2,3-B]pyridin-2-yl)-1H-pyrazolo[3,4-B] pyridines and therapeutic uses thereof US Patent  US10285983 Publication Date 5/14/2019 
Target
Name:
Proto-oncogene Wnt-1
Synonyms:
INT1 WNT1 | WNT1_HUMAN
Type:
Enzyme Catalytic Domain
Mol. Mass.:
41006.01
Organism:
Homo sapiens (human)
Description:
P04628
Residue:
370
  
Inhibitor
Name:
BDBM384757
Synonyms:
US10285983, Compound 136
Type:
Small organic molecule
Emp. Form.:
C31H24N8
Mol. Mass.:
508.5759
SMILES:
C(NCc1cncc(c1)-c1cnc2[nH]nc(-c3cc4c(ccnc4[nH]3)-c3ccncc3)c2c1)c1ccccc1
: