Target
Phosphodiesterase
Ligand
BDBM50204596
Substrate
Meas. Tech.
PDE2 Assay B
Ki
0.220±n/a nM
Citation
 Shen, DWang, DQian, XHarper, BYang, MBo, Y Pyrimidinone amide compounds as PDE2 inhibitors US Patent  US10285989 Publication Date 5/14/2019 
Target
Name:
Phosphodiesterase
Synonyms:
PDE2A3 | Phosphodiesterase A3 (PDE2A3)
Type:
Enzyme Catalytic Domain
Mol. Mass.:
105547.91
Organism:
Macaca mulatta (Rhesus macaque)
Description:
Residue:
941
  
Inhibitor
Name:
BDBM50204596
Synonyms:
CHEMBL3977461 | US10285989, Example 30
Type:
Small organic molecule
Emp. Form.:
C18H21F3N4O2S
Mol. Mass.:
414.445
SMILES:
CC(C)[C@@H](NC(=O)c1cc(=O)[nH]c(n1)N(C)C)c1ccc(SC(F)(F)F)cc1
: