Target
cGMP-dependent 3',5'-cyclic phosphodiesterase
Ligand
BDBM384908
Substrate
Meas. Tech.
PDE2 Assay B
Ki
0.150±n/a nM
Citation
 Shen, DWang, DQian, XHarper, BYang, MBo, Y Pyrimidinone amide compounds as PDE2 inhibitors US Patent  US10285989 Publication Date 5/14/2019 
Target
Name:
cGMP-dependent 3',5'-cyclic phosphodiesterase
Synonyms:
CGS-PDE Homo sapiens phosphodiesterase 2A (PDE2A) PDE2A cGSPDE
Type:
Enzyme Catalytic Domain
Mol. Mass.:
105691.58
Organism:
Homo sapiens (Human)
Description:
O00408
Residue:
941
  
Inhibitor
Name:
BDBM384908
Synonyms:
(S)- or (R)-2-(dimethylamino)-N-{1-[2- fluoro-4-(pentafluoro-lambda6-sulfanyl) phenyl]-2,2-dimethylpropyl}-6-oxo- 1,6-dihydropyrimidine-4-carboxamide US10285989, Example 128
Type:
Small organic molecule
Emp. Form.:
C18H22F6N4O2S
Mol. Mass.:
472.448
SMILES:
CN(C)c1nc(cc(=O)[nH]1)C(=O)NC(c1ccc(cc1F)S(F)(F)(F)(F)F)C(C)(C)C
: