Target
Mu-type opioid receptor
Ligand
BDBM179880
Substrate
Meas. Tech.
Functional Assay (GTPgammaS Binding)
EC50
4.20±n/a nM
Citation
 Blumberg, LCDeaver, DREyerman, DJWynn, TA Morphan and morphinan analogues, and methods of use US Patent  US10287250 Publication Date 5/14/2019 
Target
Name:
Mu-type opioid receptor
Synonyms:
M-OR-1 MOR-1 MUOR1 Mu opiate receptor OPRM1 hMOP | mu-type opioid receptor isoform MOR-1
Type:
G Protein-Coupled Receptor (GPCR)
Mol. Mass.:
44789.51
Organism:
Homo sapiens (Human)
Description:
P35372
Residue:
400
  
Inhibitor
Name:
BDBM179880
Synonyms:
US10231963, Table B.26 US10736890, Compound TABLE B.26 US11534436, Compound Table B.26 US9656961, Example 00143
Type:
Small organic molecule
Emp. Form.:
C22H28N2O4
Mol. Mass.:
384.4687
SMILES:
[#6]\[#6](-[#6])=[#6]\[#6]-[#7]-1-[#6]-[#6][C@]23[#6]-[#6](=O)-[#6]-[#6][C@@]2([#8])[#6@H]-1-[#6]-c1ccc(-[#6](-[#7])=O)c(-[#8])c31
: