Target
Mu-type opioid receptor
Ligand
BDBM50254507
Substrate
Meas. Tech.
Opioid Receptor Binding Assay
IC50
>1300±n/a nM
Citation
 Blumberg, LCDeaver, DREyerman, DJWynn, TA Morphan and morphinan analogues, and methods of use US Patent  US10287250 Publication Date 5/14/2019 
Target
Name:
Mu-type opioid receptor
Synonyms:
M-OR-1 MOR-1 MUOR1 Mu opiate receptor OPRM1 hMOP | mu-type opioid receptor isoform MOR-1
Type:
G Protein-Coupled Receptor (GPCR)
Mol. Mass.:
44789.51
Organism:
Homo sapiens (Human)
Description:
P35372
Residue:
400
  
Inhibitor
Name:
BDBM50254507
Synonyms:
CHEMBL461227 US10752592, Compound TABLE B.11 rel-(2R,6R,11R)-6,11-Dimethyl-3-(3-methyl-but-2-enyl)-1,2,3,4,5,6-hexahydro-2,6-methano-benzo[d]azocine-8-carboxylic acid amide
Type:
Small organic molecule
Emp. Form.:
C20H28N2O
Mol. Mass.:
312.4491
SMILES:
[#6]-[#6@H]1-[#6@H]-2-[#6]-c3ccc(cc3[C@]1([#6])[#6]-[#6]-[#7]-2-[#6]\[#6]=[#6](\[#6])-[#6])-[#6](-[#7])=O
: