Target
Mu-type opioid receptor
Ligand
BDBM50165048
Substrate
Meas. Tech.
Opioid Receptor Binding Assay
Ki
0.160±n/a nM
Citation
 Blumberg, LCDeaver, DREyerman, DJWynn, TA Morphan and morphinan analogues, and methods of use US Patent  US10287250 Publication Date 5/14/2019 
Target
Name:
Mu-type opioid receptor
Synonyms:
M-OR-1 MOR-1 MUOR1 Mu opiate receptor OPRM1 hMOP | mu-type opioid receptor isoform MOR-1
Type:
G Protein-Coupled Receptor (GPCR)
Mol. Mass.:
44789.51
Organism:
Homo sapiens (Human)
Description:
P35372
Residue:
400
  
Inhibitor
Name:
BDBM50165048
Synonyms:
17-cyclobutylmethyl-3,10-dihydroxy-13-oxo-(1R,9R,10S)-17-azatetracyclo[7.5.3.01,10.02,7]heptadeca-2(7),3,5-triene-4-carboxamide US10231963, Table B.16 US10736890, Compound TABLE B.16 US11534436, Compound Table B.16 US9656961, Example 00133
Type:
Small organic molecule
Emp. Form.:
C22H28N2O4
Mol. Mass.:
384.4687
SMILES:
NC(=O)c1ccc2C[C@H]3N(CC4CCC4)CC[C@@]4(CC(=O)CC[C@@]34O)c2c1O
: