Target
Mu-type opioid receptor
Ligand
BDBM179891
Substrate
Meas. Tech.
Opioid Receptor Binding Assay
IC50
1.50±n/a nM
Citation
 Blumberg, LCDeaver, DREyerman, DJWynn, TA Morphan and morphinan analogues, and methods of use US Patent  US10287250 Publication Date 5/14/2019 
Target
Name:
Mu-type opioid receptor
Synonyms:
M-OR-1 MOR-1 MUOR1 Mu opiate receptor OPRM1 hMOP | mu-type opioid receptor isoform MOR-1
Type:
G Protein-Coupled Receptor (GPCR)
Mol. Mass.:
44789.51
Organism:
Homo sapiens (Human)
Description:
P35372
Residue:
400
  
Inhibitor
Name:
BDBM179891
Synonyms:
US10287250, Compound C.9 US9133125, Table C, Compound 9 | US9656961, Example 00159
Type:
Small organic molecule
Emp. Form.:
C34H37N3O4
Mol. Mass.:
551.6753
SMILES:
Oc1c(ccc2C[C@H]3N(CC4CC4)CC[C@@]4(CC(=O)CC[C@@]34O)c12)C(=O)NCCc1ccc(cc1)-c1cccnc1
: