Target
Mu-type opioid receptor
Ligand
BDBM179896
Substrate
Meas. Tech.
Opioid Receptor Binding Assay
Ki
1.20±n/a nM
Citation
 Blumberg, LCDeaver, DREyerman, DJWynn, TA Morphan and morphinan analogues, and methods of use US Patent  US10287250 Publication Date 5/14/2019 
Target
Name:
Mu-type opioid receptor
Synonyms:
M-OR-1 MOR-1 MUOR1 Mu opiate receptor OPRM1 hMOP | mu-type opioid receptor isoform MOR-1
Type:
G Protein-Coupled Receptor (GPCR)
Mol. Mass.:
44789.51
Organism:
Homo sapiens (Human)
Description:
P35372
Residue:
400
  
Inhibitor
Name:
BDBM179896
Synonyms:
US10287250, Compound C.14 US9133125, Table C, Compound 14 | US9656961, Example 00164
Type:
Small organic molecule
Emp. Form.:
C20H28N2O
Mol. Mass.:
312.4491
SMILES:
CC1C2Cc3ccc(cc3[C@]1(C)CCN2CC1(C)CC1)C(N)=O
: