Target
Tyrosine-protein kinase JAK1
Ligand
BDBM246882
Substrate
Meas. Tech.
JAK1 Assay
IC50
<10±0 nM
Citation
 Li, YBurns, DM Fused bicyclic 1,2,4-triazine compounds as TAM inhibitors US Patent  US9708333 Publication Date 7/18/2017 
Target
Name:
Tyrosine-protein kinase JAK1
Synonyms:
JAK-1 JAK1A JAK1_HUMAN Janus kinase 1 (JAK1) | Janus kinase 1 JAK1
Type:
Protein
Mol. Mass.:
133293.73
Organism:
Homo sapiens (Human)
Description:
P23458
Residue:
1154
  
Inhibitor
Name:
BDBM246882
Synonyms:
US10053465, 21 US10125150, Example 21 US10519163, Example 21 US11084822, Example 21 US11136326, Example 21 US11324749, Comp. No. 21 US11596632, Comp. No. 21 {1-(cis-4-{[4-{[(3R)- 3-hydroxypyrrolidin- 1-yl]methyl}-6- (trifluoromethyl) pyridin-2- yl]oxy}cyclohexyl)- 3-[4-(7H-pyrrolo[2,3- d]pyrimidin-4-yl)- 1H-pyrazol-1- yl]azetidin-3- yl}acetonitrile
Type:
Small organic molecule
Emp. Form.:
C31H34F3N9O2
Mol. Mass.:
621.656
SMILES:
O[C@@H]1CCN(Cc2cc(O[C@H]3CC[C@H](CC3)N3CC(CC#N)(C3)n3cc(cn3)-c3ncnc4[nH]ccc34)nc(c2)C(F)(F)F)C1
: