Target
Tyrosine-protein kinase receptor UFO
Ligand
BDBM246867
Substrate
Meas. Tech.
TAM Enzymatic Assay
Temperature
298.15±n/a K
IC50
300±n/a nM
Comments
extracted
Citation
 Li, YBurns, DM Fused bicyclic 1,2,4-triazine compounds as TAM inhibitors US Patent  US9708333 Publication Date 7/18/2017 
Target
Name:
Tyrosine-protein kinase receptor UFO
Synonyms:
AXL TEL/AXL UFO | UFO_HUMAN
Type:
Enzyme
Mol. Mass.:
98316.97
Organism:
Homo sapiens (Human)
Description:
P30530
Residue:
894
  
Inhibitor
Name:
BDBM246867
Synonyms:
4-[(4-{3-cyano-2-[3- (7H-pyrrolo[2,3- d]pyrimidin-4-yl)- 1H-pyrrol-1- yl]propyl}piperazin- 1-yl)carbonyl]-3- fluorobenzonitrile US10065963, Compound 6 US10336759, # 6 US10519163, Example 6 US11084822, Example 6 US11136326, Example 6 US11324749, Comp. No. 9 US11596632, Comp. No. 9 | US9732097, Example 6
Type:
Small organic molecule
Emp. Form.:
C26H23FN8O
Mol. Mass.:
482.5122
SMILES:
Fc1cc(ccc1C(=O)N1CCN(CC(CC#N)n2ccc(c2)-c2ncnc3[nH]ccc23)CC1)C#N
: