Target
Tyrosine-protein kinase receptor UFO
Ligand
BDBM246872
Substrate
Meas. Tech.
TAM Enzymatic Assay
Temperature
298.15±n/a K
IC50
>1000±n/a nM
Comments
extracted
Citation
 Li, YBurns, DM Fused bicyclic 1,2,4-triazine compounds as TAM inhibitors US Patent  US9708333 Publication Date 7/18/2017 
Target
Name:
Tyrosine-protein kinase receptor UFO
Synonyms:
AXL TEL/AXL UFO | UFO_HUMAN
Type:
Enzyme
Mol. Mass.:
98316.97
Organism:
Homo sapiens (Human)
Description:
P30530
Residue:
894
  
Inhibitor
Name:
BDBM246872
Synonyms:
US10053465, 11 US10125150, Example 11 US10479803, Example 11 US10675284, Example 11 US11130767, # 11 US11304949, Compound 11 US11406640, Comp. No. 11 US9732097, Example 11 | {trans-3-(4-{[4-[(3- hydroxyazetidin-1- yl)methyl]-6- (trifluoromethyl) pyridin-2- yl]oxy}piperidin-1- yl)-1-[4-(7H- pyrrolo[2,3- d]pyrimidin-4-yl)- 1H-pyrazol-1- yl]cydobutyl} acetonitrile
Type:
Small organic molecule
Emp. Form.:
C30H32F3N9O2
Mol. Mass.:
607.6294
SMILES:
OC1CN(Cc2cc(OC3CCN(CC3)[C@H]3C[C@@](CC#N)(C3)n3cc(cn3)-c3ncnc4[nH]ccc34)nc(c2)C(F)(F)F)C1
: