Target
Toll-like receptor 7
Ligand
BDBM384993
Substrate
Meas. Tech.
HEK TLR7 Assay
EC50
5500±n/a nM
Citation
 Wu, TY Substituted pyrimidines containing acidic groups as TLR7 modulators US Patent  US10287253 Publication Date 5/14/2019 
Target
Name:
Toll-like receptor 7
Synonyms:
ORF Names:UNQ248/PRO285 TLR7_HUMAN | Toll-like receptor 7 (TLR7)
Type:
Enzyme
Mol. Mass.:
120945.35
Organism:
Homo sapiens (Human)
Description:
Q9NYK1
Residue:
1049
  
Inhibitor
Name:
BDBM384993
Synonyms:
2-(5-(3-((2-amino-4-(butylamino)-6-methylpyrimidin-5-yl)methyl)-4-methoxybenzyl)-2H-tetrazol-2-yl)acetic acid | US10287253, Example 5
Type:
Small organic molecule
Emp. Form.:
C21H28N8O3
Mol. Mass.:
440.4988
SMILES:
CCCCNc1nc(N)nc(C)c1Cc1cc(Cc2nnn(CC(O)=O)n2)ccc1OC
: