Target
Toll-like receptor 7
Ligand
BDBM385016
Substrate
Meas. Tech.
HEK TLR7 Assay
EC50
550±n/a nM
Citation
 Wu, TY Substituted pyrimidines containing acidic groups as TLR7 modulators US Patent  US10287253 Publication Date 5/14/2019 
Target
Name:
Toll-like receptor 7
Synonyms:
ORF Names:UNQ248/PRO285 TLR7_HUMAN | Toll-like receptor 7 (TLR7)
Type:
Enzyme
Mol. Mass.:
120945.35
Organism:
Homo sapiens (Human)
Description:
Q9NYK1
Residue:
1049
  
Inhibitor
Name:
BDBM385016
Synonyms:
(S)-3-(2-amino-6-((1-hydroxyheptan-3-yl)amino)-5-(2-methoxybenzyl)-pyrimidin-4-yl)propanoic acid US10287253, Example 28
Type:
Small organic molecule
Emp. Form.:
C22H32N4O4
Mol. Mass.:
416.5139
SMILES:
CCCC[C@@H](CCO)Nc1nc(N)nc(CCC(O)=O)c1Cc1ccccc1OC
: