Target
Mitogen-activated protein kinase 10
Ligand
BDBM25191
Substrate
BDBM25978
Meas. Tech.
Fluorescence Polarization Assay
pH
7.5±n/a
Temperature
295.15±n/a K
Ki
>4000±n/a nM
IC50
>16000±n/a nM
Citation
 Angell, RMBamborough, PCleasby, ACockerill, SGJones, KLMooney, CJSomers, DOWalker, AL Biphenyl amide p38 kinase inhibitors 1: Discovery and binding mode. Bioorg Med Chem Lett 18:318-23 (2008)  
Target
Name:
Mitogen-activated protein kinase 10
Synonyms:
JNK3 MAP kinase p49 3F12 MK10_HUMAN Mitogen-activated protein kinase 10 (Stress-activated protein kinase JNK3) (c-Jun N-terminal kinase 3) (MAP kinase p49 3F12) PRKM10 Stress-activated protein kinase JNK3 | c-Jun N-terminal kinase 3 (JNK3)
Type:
Enzyme
Mol. Mass.:
52586.89
Organism:
Homo sapiens (Human)
Description:
Residue:
464
  
Inhibitor
Name:
BDBM25191
Synonyms:
4-{4-[(5-hydroxy-2-methylphenyl)amino]quinolin-7-yl}-1,3-thiazole-2-carbaldehyde BMCL174363 Compound 1 | BMCL18318 Compound 1
Type:
Small organic molecule
Emp. Form.:
C20H15N3O2S
Mol. Mass.:
361.417
SMILES:
Cc1ccc(O)cc1Nc1ccnc2cc(ccc12)-c1csc(C=O)n1
:
Substrate
Name:
BDBM25978
Synonyms:
2-(6-amino-3-imino-3H-xanthen-9-yl)-5-[({4-[4-(4-chloro-3-hydroxyphenyl)-5-(pyridin-4-yl)-1H-imidazol-2-yl]phenyl}methyl)carbamoyl]benzoic acid Rhodamine-green Labelled Fluoroligand
Type:
fluorescent ligand
Emp. Form.:
C42H29ClN6O5
Mol. Mass.:
733.17
SMILES:
Nc1ccc2c(-c3ccc(cc3C(O)=O)C(=O)NCc3ccc(cc3)-c3nc(c([nH]3)-c3ccc(Cl)c(O)c3)-c3ccncc3)c3ccc(=N)cc3oc2c1
: