Target
Mitogen-activated protein kinase 10
Ligand
BDBM25980
Substrate
BDBM25978
Meas. Tech.
Fluorescence Polarization Assay
pH
7.5±n/a
Temperature
295.15±n/a K
Ki
>4000±n/a nM
IC50
>16000±n/a nM
Citation
 Angell, RMBamborough, PCleasby, ACockerill, SGJones, KLMooney, CJSomers, DOWalker, AL Biphenyl amide p38 kinase inhibitors 1: Discovery and binding mode. Bioorg Med Chem Lett 18:318-23 (2008)  
Target
Name:
Mitogen-activated protein kinase 10
Synonyms:
JNK3 MAP kinase p49 3F12 MK10_HUMAN Mitogen-activated protein kinase 10 (Stress-activated protein kinase JNK3) (c-Jun N-terminal kinase 3) (MAP kinase p49 3F12) PRKM10 Stress-activated protein kinase JNK3 | c-Jun N-terminal kinase 3 (JNK3)
Type:
Enzyme
Mol. Mass.:
52586.89
Organism:
Homo sapiens (Human)
Description:
Residue:
464
  
Inhibitor
Name:
BDBM25980
Synonyms:
BMCL18324 Compound 3 N-(3-cyanophenyl)-4-[2-methyl-5-(5-methyl-1,3,4-oxadiazol-2-yl)phenyl]benzamide | biphenyl amide, 3
Type:
Small organic molecule
Emp. Form.:
C24H18N4O2
Mol. Mass.:
394.4253
SMILES:
Cc1nnc(o1)-c1ccc(C)c(c1)-c1ccc(cc1)C(=O)Nc1cccc(c1)C#N
:
Substrate
Name:
BDBM25978
Synonyms:
2-(6-amino-3-imino-3H-xanthen-9-yl)-5-[({4-[4-(4-chloro-3-hydroxyphenyl)-5-(pyridin-4-yl)-1H-imidazol-2-yl]phenyl}methyl)carbamoyl]benzoic acid Rhodamine-green Labelled Fluoroligand
Type:
fluorescent ligand
Emp. Form.:
C42H29ClN6O5
Mol. Mass.:
733.17
SMILES:
Nc1ccc2c(-c3ccc(cc3C(O)=O)C(=O)NCc3ccc(cc3)-c3nc(c([nH]3)-c3ccc(Cl)c(O)c3)-c3ccncc3)c3ccc(=N)cc3oc2c1
: