Target
Proto-oncogene Wnt-1
Ligand
BDBM385118
Substrate
Meas. Tech.
The screening assay for Wnt activity
EC50
3720±n/a nM
Citation
 KC, SKMittapalli, GKHofilena, BJMarakovits, JTChiruta, CMak, CCCao, J Isoquinolin-3-yl carboxamides and preparation and use thereof US Patent  US10287267 Publication Date 5/14/2019 
Target
Name:
Proto-oncogene Wnt-1
Synonyms:
INT1 WNT1 | WNT1_HUMAN
Type:
Enzyme Catalytic Domain
Mol. Mass.:
41006.01
Organism:
Homo sapiens (human)
Description:
P04628
Residue:
370
  
Inhibitor
Name:
BDBM385118
Synonyms:
US10287267, Compound 274 US10556885, Compound 274 US11673881, Compound 274
Type:
Small organic molecule
Emp. Form.:
C19H20FN5O
Mol. Mass.:
353.3934
SMILES:
Cn1cc(cn1)-c1ccc2cnc(NC(=O)CN3CC[C@@H](F)C3)cc2c1
: