Target
Dual specificity tyrosine-phosphorylation-regulated kinase 1A
Ligand
BDBM385246
Substrate
Meas. Tech.
The screening assay for DYRK1A kinase activity
EC50
0.900±n/a nM
Citation
 KC, SKMittapalli, GKHofilena, BJMarakovits, JTChiruta, CMak, CCCao, J Isoquinolin-3-yl carboxamides and preparation and use thereof US Patent  US10287267 Publication Date 5/14/2019 
Target
Name:
Dual specificity tyrosine-phosphorylation-regulated kinase 1A
Synonyms:
DYR1A_HUMAN DYRK1A Dual specificity YAK1-related kinase 1A (Dyrk1A) Dual-specificity tyrosine-phosphorylation regulated kinase 1A HP86 MNBH
Type:
Enzyme
Mol. Mass.:
85616.61
Organism:
Homo sapiens (Human)
Description:
Q13627
Residue:
763
  
Inhibitor
Name:
BDBM385246
Synonyms:
US10287267, Compound 741 US10556885, Compound 741 US11673881, Compound 741
Type:
Small organic molecule
Emp. Form.:
C24H27N5O2S
Mol. Mass.:
449.568
SMILES:
O=C(CN1CCCC1)N1CCC(CC1)C(=O)Nc1cc2cc(ccc2cn1)-c1cncs1
: