Target
Dual specificity tyrosine-phosphorylation-regulated kinase 1A
Ligand
BDBM385079
Substrate
Meas. Tech.
The screening assay for DYRK1A kinase activity
EC50
3.00±n/a nM
Citation
 KC, SKMittapalli, GKHofilena, BJMarakovits, JTChiruta, CMak, CCCao, J Isoquinolin-3-yl carboxamides and preparation and use thereof US Patent  US10287267 Publication Date 5/14/2019 
Target
Name:
Dual specificity tyrosine-phosphorylation-regulated kinase 1A
Synonyms:
DYR1A_HUMAN DYRK1A Dual specificity YAK1-related kinase 1A (Dyrk1A) Dual-specificity tyrosine-phosphorylation regulated kinase 1A HP86 MNBH
Type:
Enzyme
Mol. Mass.:
85616.61
Organism:
Homo sapiens (Human)
Description:
Q13627
Residue:
763
  
Inhibitor
Name:
BDBM385079
Synonyms:
US10287267, Compound 1086 US10287267, Compound 77 US10508099, Compound 972 US10604514, Compound 6 US11673881, Compound 77
Type:
Small organic molecule
Emp. Form.:
C23H29N5O
Mol. Mass.:
391.5093
SMILES:
CC(C)CN1CCC(CC1)C(=O)Nc1cc2cc(ccc2cn1)-c1cnn(C)c1
: