Target
Dual specificity tyrosine-phosphorylation-regulated kinase 1A
Ligand
BDBM385287
Substrate
Meas. Tech.
The screening assay for DYRK1A kinase activity
EC50
13.5±n/a nM
Citation
 KC, SKMittapalli, GKHofilena, BJMarakovits, JTChiruta, CMak, CCCao, J Isoquinolin-3-yl carboxamides and preparation and use thereof US Patent  US10287267 Publication Date 5/14/2019 
Target
Name:
Dual specificity tyrosine-phosphorylation-regulated kinase 1A
Synonyms:
DYR1A_HUMAN DYRK1A Dual specificity YAK1-related kinase 1A (Dyrk1A) Dual-specificity tyrosine-phosphorylation regulated kinase 1A HP86 MNBH
Type:
Enzyme
Mol. Mass.:
85616.61
Organism:
Homo sapiens (Human)
Description:
Q13627
Residue:
763
  
Inhibitor
Name:
BDBM385287
Synonyms:
US10287267, Compound 974 US10556885, Compound 974 US11673881, Compound 974
Type:
Small organic molecule
Emp. Form.:
C17H15N3O3
Mol. Mass.:
309.3193
SMILES:
O=C(Nc1cc2cc(ccc2cn1)-c1cnco1)[C@H]1CCCO1
: