Target
Dual specificity tyrosine-phosphorylation-regulated kinase 1A
Ligand
BDBM385299
Substrate
Meas. Tech.
The screening assay for DYRK1A kinase activity
EC50
11.0±n/a nM
Citation
 KC, SKMittapalli, GKHofilena, BJMarakovits, JTChiruta, CMak, CCCao, J Isoquinolin-3-yl carboxamides and preparation and use thereof US Patent  US10287267 Publication Date 5/14/2019 
Target
Name:
Dual specificity tyrosine-phosphorylation-regulated kinase 1A
Synonyms:
DYR1A_HUMAN DYRK1A Dual specificity YAK1-related kinase 1A (Dyrk1A) Dual-specificity tyrosine-phosphorylation regulated kinase 1A HP86 MNBH
Type:
Enzyme
Mol. Mass.:
85616.61
Organism:
Homo sapiens (Human)
Description:
Q13627
Residue:
763
  
Inhibitor
Name:
BDBM385299
Synonyms:
US10287267, Compound 986 US10556885, Compound 986 US11673881, Compound 986
Type:
Small organic molecule
Emp. Form.:
C20H19F2N5O
Mol. Mass.:
383.3946
SMILES:
FC1(F)CC(C1)C(=O)Nc1cc2cc(ccc2cn1)-c1cnc2CNCCn12
: