Target
Glycogen synthase kinase-3 beta
Ligand
BDBM385219
Substrate
Meas. Tech.
The screening for GSK3beta kinase activity
EC50
4.00±n/a nM
Citation
 KC, SKMittapalli, GKHofilena, BJMarakovits, JTChiruta, CMak, CCCao, J Isoquinolin-3-yl carboxamides and preparation and use thereof US Patent  US10287267 Publication Date 5/14/2019 
Target
Name:
Glycogen synthase kinase-3 beta
Synonyms:
GSK-3 beta GSK3B Glycogen synthase kinase 3 beta (GSK3B) Glycogen synthase kinase-3 beta (GSK-3B) Glycogen synthase kinase-3 beta (GSK3B) Glycogen synthase kinase-3beta (GSK3B) | Serine/threonine-protein kinase GSK3B
Type:
Enzyme
Mol. Mass.:
46756.38
Organism:
Homo sapiens (Human)
Description:
P49841
Residue:
420
  
Inhibitor
Name:
BDBM385219
Synonyms:
US10287267, Compound 481 US10556885, Compound 481 US11673881, Compound 481
Type:
Small organic molecule
Emp. Form.:
C18H20N6O
Mol. Mass.:
336.391
SMILES:
Cn1cc(nn1)-c1ccc2cnc(NC(=O)[C@@H]3CCCNC3)cc2c1
: