Target
Tyrosine-protein kinase HCK
Ligand
BDBM385383
Substrate
Meas. Tech.
Protein Kinase Assays
IC50
111±n/a nM
Citation
 Gray, NSChoi, HGLiang, Y Imidazolyl kinase inhibitors and uses thereof US Patent  US10287268 Publication Date 5/14/2019 
Target
Name:
Tyrosine-protein kinase HCK
Synonyms:
HCK Hematopoietic cell kinase p59-HCK/p60-HCK p61Hck
Type:
Enzyme Catalytic Domain
Mol. Mass.:
59600.18
Organism:
Homo sapiens (Human)
Description:
P08631
Residue:
526
  
Inhibitor
Name:
BDBM385383
Synonyms:
6-(2-((2,6-Dimethylphenyl)amino)-1H-imidazol-1-yl)-N-(4-(4-ethylpiperazin-1-yl)phenyl)pyrimidin-4-amine US10975058, Compound I-1
Type:
Small organic molecule
Emp. Form.:
C27H32N8
Mol. Mass.:
468.5966
SMILES:
CCN1CCN(CC1)c1ccc(Nc2cc(ncn2)-n2ccnc2Nc2c(C)cccc2C)cc1
: