Target
Lysine-specific demethylase 4E
Ligand
BDBM26116
Substrate
Histone H3 fragment substrate
Meas. Tech.
FDH Coupled Inhibition Assay
pH
7.5±n/a
Temperature
310.15±n/a K
IC50
120000±n/a nM
Citation
 Rose, NRNg, SSMecinovic;, JLiénard, MRBello, SHSun, ZMcDonough, MAOppermann, USchofield, CJ Inhibitor Scaffolds for 2-Oxoglutarate-Dependent Histone Lysine Demethylases. J Med Chem 51:7053-6 (2008)  
Target
Name:
Lysine-specific demethylase 4E
Synonyms:
2-OG-Dependent Histone Demethylase JMJD2E Jumonji domain-containing protein 2E (JMJD2E) KDM4DL KDM4E_HUMAN Lysine-specific demethylase 4E | Lysine-specific demethylase 4E (KDM4E)
Type:
Enzyme
Mol. Mass.:
56815.71
Organism:
Homo sapiens (Human)
Description:
B2RXH2
Residue:
506
  
Inhibitor
Name:
BDBM26116
Synonyms:
CHEMBL284104 pyridine carboxylate, 6d | pyridine-2,6-dicarboxylic acid
Type:
Small organic molecule
Emp. Form.:
C7H5NO4
Mol. Mass.:
167.1189
SMILES:
OC(=O)c1cccc(n1)C(O)=O
:
Substrate
Name:
Histone H3 fragment substrate
Synonyms:
H3K9me3
Type:
8-mer
Mol. Mass.:
1066.23
Organism:
Description:
2-OG as co-substrate.
Residue:
10
ARKMESTGGK