Target
Nuclear receptor ROR-gamma
Ligand
BDBM385446
Substrate
Meas. Tech.
Biological Assay for RORgammaT Activity
IC50
586±n/a nM
Citation
 Lapointe, BTFuller, PHGunaydin, HLiu, KScott, METrotter, BWZhang, H Substituted indazole compounds as RORgammaT inhibitors and uses thereof US Patent  US10287272 Publication Date 5/14/2019 
Target
Name:
Nuclear receptor ROR-gamma
Synonyms:
NR1F3 Nuclear receptor ROR-gamma (RORC) RAR-related orphan receptor C (RORc) RORG RZRG Retinoid-related orphan receptor-gamma (RORc)
Type:
Enzyme Catalytic Domain
Mol. Mass.:
58218.40
Organism:
Homo sapiens (Human)
Description:
P51449
Residue:
518
  
Inhibitor
Name:
BDBM385446
Synonyms:
4-((R or S)-1-(2-chloro- 6-cyclopropylbenzoyl)- 6-(2-oxa-6- azaspiro[3.3]heptane-6- carbonyl)-4,5,6,7- tetrahydro-1H-indazol- 3-yl)cyclohex-3-ene-1- carboxylic acid US10287272, Example 3C | US10689369, Example 3C
Type:
Small organic molecule
Emp. Form.:
C30H32ClN3O5
Mol. Mass.:
550.045
SMILES:
OC(=O)C1CCC(=CC1)c1nn(C(=O)c2c(Cl)cccc2C2CC2)c2CC(CCc12)C(=O)N1CC2(COC2)C1
: