Target
Nuclear receptor ROR-gamma
Ligand
BDBM385472
Substrate
Meas. Tech.
Biological Assay for RORgammaT Activity
IC50
8.00±n/a nM
Citation
 Lapointe, BTFuller, PHGunaydin, HLiu, KScott, METrotter, BWZhang, H Substituted indazole compounds as RORgammaT inhibitors and uses thereof US Patent  US10287272 Publication Date 5/14/2019 
Target
Name:
Nuclear receptor ROR-gamma
Synonyms:
NR1F3 Nuclear receptor ROR-gamma (RORC) RAR-related orphan receptor C (RORc) RORG RZRG Retinoid-related orphan receptor-gamma (RORc)
Type:
Enzyme Catalytic Domain
Mol. Mass.:
58218.40
Organism:
Homo sapiens (Human)
Description:
P51449
Residue:
518
  
Inhibitor
Name:
BDBM385472
Synonyms:
(R or S)-4-((R or S)-1- (2-chloro-6-(1- (trifluoromethyl)cyclopropyl) benzoyl)-6-((2- fluorophenyl)carbamoyl)- 4,5,6,7-tetrahydro-1H- indazol-3-yl)cyclohex-3- ene-1-carboxylic acid US10689369, Example 5Q
Type:
Small organic molecule
Emp. Form.:
C32H28ClF4N3O4
Mol. Mass.:
630.029
SMILES:
OC(=O)C1CCC(=CC1)c1nn(C(=O)c2c(Cl)cccc2C2(CC2)C(F)(F)F)c2CC(CCc12)C(=O)Nc1ccccc1F
: