Target
Metallo-beta-lactamase type 2
Ligand
BDBM262601
Substrate
Meas. Tech.
Class B Enzyme Assay
pH
7±n/a
IC50
6.88±n/a nM
Comments
extracted
Citation
 Mandal, MTang, HXiao, LSu, JLi, GYang, SPan, WTang, HDeJesus, RHicks, JLombardo, MChu, HHagmann, WPasternak, AGu, XJiang, JDong, SDing, FLondon, CBiswas, DYoung, KHunter, DNZhao, ZYang, D Metallo-beta-lactamase inhibitors US Patent  US9708336 Publication Date 7/18/2017 
Target
Name:
Metallo-beta-lactamase type 2
Synonyms:
B2 metallo-beta-lactamase Beta-lactamase NDM-1 Metallo-beta-lactamase NDM-1 Metallo-beta-lactamase type II New Delhi metallo-beta-lactamase-1 | blaNDM-1
Type:
PROTEIN
Mol. Mass.:
28498.15
Organism:
Klebsiella pneumoniae
Description:
ChEMBL_103887
Residue:
270
  
Inhibitor
Name:
BDBM262601
Synonyms:
6-(2-cyanoethyl)-3-(quinolin-4-yl)-2-(2H-tetrazol-5-yl)benzenesulfonamide | US9708336, 453
Type:
Small organic molecule
Emp. Form.:
C19H15N7O2S
Mol. Mass.:
405.433
SMILES:
NS(=O)(=O)c1c(CCC#N)ccc(-c2ccnc3ccccc23)c1-c1nn[nH]n1
: