Target
VIM-1 metallo-beta-lactamase
Ligand
BDBM262611
Substrate
Meas. Tech.
Class B Enzyme Assay
pH
7±n/a
IC50
4.42±n/a nM
Comments
extracted
Citation
 Mandal, MTang, HXiao, LSu, JLi, GYang, SPan, WTang, HDeJesus, RHicks, JLombardo, MChu, HHagmann, WPasternak, AGu, XJiang, JDong, SDing, FLondon, CBiswas, DYoung, KHunter, DNZhao, ZYang, D Metallo-beta-lactamase inhibitors US Patent  US9708336 Publication Date 7/18/2017 
Target
Name:
VIM-1 metallo-beta-lactamase
Synonyms:
Beta-lactamase VIM-1 VIM-1 metallo-beta-lactamase | blaVIM-1
Type:
undefined
Mol. Mass.:
28014.53
Organism:
Klebsiella pneumoniae
Description:
Q5GN09
Residue:
266
  
Inhibitor
Name:
BDBM262611
Synonyms:
4-(((1r,4r)-4-aminocyclohexyl)methyl)-4′-(piperidin- 4-yl)-2-(2H-tetrazol-5-yl)-[1,1′-biphenyl]-3- sulfonamide | US9708336, 463
Type:
Small organic molecule
Emp. Form.:
C25H33N7O2S
Mol. Mass.:
495.64
SMILES:
N[C@H]1CCC(Cc2ccc(-c3ccc(cc3)C3CCNCC3)c(-c3nn[nH]n3)c2S(N)(=O)=O)CC1
: