Target
VIM-1 metallo-beta-lactamase
Ligand
BDBM262661
Substrate
Meas. Tech.
Class B Enzyme Assay
pH
7±n/a
IC50
0.138±n/a nM
Comments
extracted
Citation
 Mandal, MTang, HXiao, LSu, JLi, GYang, SPan, WTang, HDeJesus, RHicks, JLombardo, MChu, HHagmann, WPasternak, AGu, XJiang, JDong, SDing, FLondon, CBiswas, DYoung, KHunter, DNZhao, ZYang, D Metallo-beta-lactamase inhibitors US Patent  US9708336 Publication Date 7/18/2017 
Target
Name:
VIM-1 metallo-beta-lactamase
Synonyms:
Beta-lactamase VIM-1 VIM-1 metallo-beta-lactamase | blaVIM-1
Type:
undefined
Mol. Mass.:
28014.53
Organism:
Klebsiella pneumoniae
Description:
Q5GN09
Residue:
266
  
Inhibitor
Name:
BDBM262661
Synonyms:
5-(3-Sulfamoyl-2-(2H-tetrazol-5-yl)- 4-(trifluoromethyl)phenyl)quinoline 1- oxide | US9708336, 514
Type:
Small organic molecule
Emp. Form.:
C17H11F3N6O3S
Mol. Mass.:
436.368
SMILES:
NS(=O)(=O)c1c(ccc(-c2cccc3[n+]([O-])cccc23)c1-c1nn[nH]n1)C(F)(F)F
: