Target
VIM-1 metallo-beta-lactamase
Ligand
BDBM262715
Substrate
Meas. Tech.
Class B Enzyme Assay
pH
7±n/a
IC50
0.161±n/a nM
Comments
extracted
Citation
 Mandal, MTang, HXiao, LSu, JLi, GYang, SPan, WTang, HDeJesus, RHicks, JLombardo, MChu, HHagmann, WPasternak, AGu, XJiang, JDong, SDing, FLondon, CBiswas, DYoung, KHunter, DNZhao, ZYang, D Metallo-beta-lactamase inhibitors US Patent  US9708336 Publication Date 7/18/2017 
Target
Name:
VIM-1 metallo-beta-lactamase
Synonyms:
Beta-lactamase VIM-1 VIM-1 metallo-beta-lactamase | blaVIM-1
Type:
undefined
Mol. Mass.:
28014.53
Organism:
Klebsiella pneumoniae
Description:
Q5GN09
Residue:
266
  
Inhibitor
Name:
BDBM262715
Synonyms:
3-(2-amino-4-methyl-1H-benzo[d]imidazol-7-yl)-2-(1H-tetrazol-5-yl)-6-(trifluoromethyl)benzenesulfonamide | US9708336, 568
Type:
Small organic molecule
Emp. Form.:
C16H13F3N8O2S
Mol. Mass.:
438.387
SMILES:
Cc1ccc(-c2ccc(c(c2-c2nnn[nH]2)S(N)(=O)=O)C(F)(F)F)c2[nH]c(N)nc12
: