Target
VIM-1 metallo-beta-lactamase
Ligand
BDBM262776
Substrate
Meas. Tech.
Class B Enzyme Assay
pH
7±n/a
IC50
668±n/a nM
Comments
extracted
Citation
 Mandal, MTang, HXiao, LSu, JLi, GYang, SPan, WTang, HDeJesus, RHicks, JLombardo, MChu, HHagmann, WPasternak, AGu, XJiang, JDong, SDing, FLondon, CBiswas, DYoung, KHunter, DNZhao, ZYang, D Metallo-beta-lactamase inhibitors US Patent  US9708336 Publication Date 7/18/2017 
Target
Name:
VIM-1 metallo-beta-lactamase
Synonyms:
Beta-lactamase VIM-1 VIM-1 metallo-beta-lactamase | blaVIM-1
Type:
undefined
Mol. Mass.:
28014.53
Organism:
Klebsiella pneumoniae
Description:
Q5GN09
Residue:
266
  
Inhibitor
Name:
BDBM262776
Synonyms:
3-[6-[methyl(2-pyrrolidin-1- ylethyl)amino]-3-pyridyl]-2- (1H-tetrazol-5- yl)benzenesulfonamide | US9708336, 629
Type:
Small organic molecule
Emp. Form.:
C19H24N8O2S
Mol. Mass.:
428.511
SMILES:
CN(CCN1CCCC1)c1ccc(cn1)-c1cccc(c1-c1nnn[nH]1)S(N)(=O)=O
: