Target
Metallo-beta-lactamase type 2
Ligand
BDBM262837
Substrate
Meas. Tech.
Class B Enzyme Assay
pH
7±n/a
IC50
12.6±n/a nM
Comments
extracted
Citation
 Mandal, MTang, HXiao, LSu, JLi, GYang, SPan, WTang, HDeJesus, RHicks, JLombardo, MChu, HHagmann, WPasternak, AGu, XJiang, JDong, SDing, FLondon, CBiswas, DYoung, KHunter, DNZhao, ZYang, D Metallo-beta-lactamase inhibitors US Patent  US9708336 Publication Date 7/18/2017 
Target
Name:
Metallo-beta-lactamase type 2
Synonyms:
B2 metallo-beta-lactamase Beta-lactamase NDM-1 Metallo-beta-lactamase NDM-1 Metallo-beta-lactamase type II New Delhi metallo-beta-lactamase-1 | blaNDM-1
Type:
PROTEIN
Mol. Mass.:
28498.15
Organism:
Klebsiella pneumoniae
Description:
ChEMBL_103887
Residue:
270
  
Inhibitor
Name:
BDBM262837
Synonyms:
3-{4-[(4- aminocyclohexyl)amino] cyclohexyl}-2-(1H- tetrazol-5-yl)-6- (trifluoromethyl)benzene sulfonamide | US9708336, 690
Type:
Small organic molecule
Emp. Form.:
C20H28F3N7O2S
Mol. Mass.:
487.542
SMILES:
NC1CCC(CC1)N[C@H]1CC[C@@H](CC1)c1ccc(c(c1-c1nnn[nH]1)S(N)(=O)=O)C(F)(F)F
: