Target
Metallo-beta-lactamase type 2
Ligand
BDBM262863
Substrate
Meas. Tech.
Class B Enzyme Assay
pH
7±n/a
IC50
8.07±n/a nM
Comments
extracted
Citation
 Mandal, MTang, HXiao, LSu, JLi, GYang, SPan, WTang, HDeJesus, RHicks, JLombardo, MChu, HHagmann, WPasternak, AGu, XJiang, JDong, SDing, FLondon, CBiswas, DYoung, KHunter, DNZhao, ZYang, D Metallo-beta-lactamase inhibitors US Patent  US9708336 Publication Date 7/18/2017 
Target
Name:
Metallo-beta-lactamase type 2
Synonyms:
B2 metallo-beta-lactamase Beta-lactamase NDM-1 Metallo-beta-lactamase NDM-1 Metallo-beta-lactamase type II New Delhi metallo-beta-lactamase-1 | blaNDM-1
Type:
PROTEIN
Mol. Mass.:
28498.15
Organism:
Klebsiella pneumoniae
Description:
ChEMBL_103887
Residue:
270
  
Inhibitor
Name:
BDBM262863
Synonyms:
4'-pyrrolidin-2-yl-2-(1H- tetrazol-5-yl)-4- (trifluoromethyl)biphenyl-3- sulfonamide | US9708336, 716
Type:
Small organic molecule
Emp. Form.:
C18H17F3N6O2S
Mol. Mass.:
438.427
SMILES:
NS(=O)(=O)c1c(ccc(-c2ccc(cc2)C2CCCN2)c1-c1nnn[nH]1)C(F)(F)F
: