Target
Metallo-beta-lactamase type 2
Ligand
BDBM262902
Substrate
Meas. Tech.
Class B Enzyme Assay
pH
7±n/a
IC50
22.1±n/a nM
Comments
extracted
Citation
 Mandal, MTang, HXiao, LSu, JLi, GYang, SPan, WTang, HDeJesus, RHicks, JLombardo, MChu, HHagmann, WPasternak, AGu, XJiang, JDong, SDing, FLondon, CBiswas, DYoung, KHunter, DNZhao, ZYang, D Metallo-beta-lactamase inhibitors US Patent  US9708336 Publication Date 7/18/2017 
Target
Name:
Metallo-beta-lactamase type 2
Synonyms:
B2 metallo-beta-lactamase BLAB_SERMA IMP-1 | Metallo-beta-lactamase type II
Type:
undefined
Mol. Mass.:
27125.88
Organism:
Serratia marcescens
Description:
P52699
Residue:
246
  
Inhibitor
Name:
BDBM262902
Synonyms:
3-[4-(2-aminoethyl)piperidin-1- yl]-2-(1H-tetrazol-5-yl)-6- (trifluoromethyl) benzenesulfonamide | US9708336, 755
Type:
Small organic molecule
Emp. Form.:
C15H20F3N7O2S
Mol. Mass.:
419.425
SMILES:
NCCC1CCN(CC1)c1ccc(c(c1-c1nnn[nH]1)S(N)(=O)=O)C(F)(F)F
: