Target
Metallo-beta-lactamase type 2
Ligand
BDBM262903
Substrate
Meas. Tech.
Class B Enzyme Assay
pH
7±n/a
IC50
89.1±n/a nM
Comments
extracted
Citation
 Mandal, MTang, HXiao, LSu, JLi, GYang, SPan, WTang, HDeJesus, RHicks, JLombardo, MChu, HHagmann, WPasternak, AGu, XJiang, JDong, SDing, FLondon, CBiswas, DYoung, KHunter, DNZhao, ZYang, D Metallo-beta-lactamase inhibitors US Patent  US9708336 Publication Date 7/18/2017 
Target
Name:
Metallo-beta-lactamase type 2
Synonyms:
B2 metallo-beta-lactamase BLAB_SERMA IMP-1 | Metallo-beta-lactamase type II
Type:
undefined
Mol. Mass.:
27125.88
Organism:
Serratia marcescens
Description:
P52699
Residue:
246
  
Inhibitor
Name:
BDBM262903
Synonyms:
3-[(3R,4R)-3,4- dihydroxypyrrolidin-1-yl]-2-(1H- tetrazol-5-yl)-6- (trifluoromethyl) benzenesulfonamide | US9708336, 756
Type:
Small organic molecule
Emp. Form.:
C12H13F3N6O4S
Mol. Mass.:
394.33
SMILES:
NS(=O)(=O)c1c(ccc(N2C[C@@H](O)[C@H](O)C2)c1-c1nnn[nH]1)C(F)(F)F
: