Target
Metallo-beta-lactamase type 2
Ligand
BDBM262908
Substrate
Meas. Tech.
Class B Enzyme Assay
pH
7±n/a
IC50
46.0±n/a nM
Comments
extracted
Citation
 Mandal, MTang, HXiao, LSu, JLi, GYang, SPan, WTang, HDeJesus, RHicks, JLombardo, MChu, HHagmann, WPasternak, AGu, XJiang, JDong, SDing, FLondon, CBiswas, DYoung, KHunter, DNZhao, ZYang, D Metallo-beta-lactamase inhibitors US Patent  US9708336 Publication Date 7/18/2017 
Target
Name:
Metallo-beta-lactamase type 2
Synonyms:
B2 metallo-beta-lactamase Beta-lactamase NDM-1 Metallo-beta-lactamase NDM-1 Metallo-beta-lactamase type II New Delhi metallo-beta-lactamase-1 | blaNDM-1
Type:
PROTEIN
Mol. Mass.:
28498.15
Organism:
Klebsiella pneumoniae
Description:
ChEMBL_103887
Residue:
270
  
Inhibitor
Name:
BDBM262908
Synonyms:
3-(1-amino-8-azaspiro[4.5]dec- 8-yl)-2-(1H-tetrazol-5-yl)-6- (trifluoromethyl) benzenesulfonamide | US9708336, 761
Type:
Small organic molecule
Emp. Form.:
C17H22F3N7O2S
Mol. Mass.:
445.462
SMILES:
NC1CCCC11CCN(CC1)c1ccc(c(c1-c1nnn[nH]1)S(N)(=O)=O)C(F)(F)F
: