Target
5-hydroxytryptamine receptor 7
Ligand
BDBM352240
Substrate
Meas. Tech.
Radiolabel Binding Studies for Serotonin 5-HT7 Receptors, Method 2
IC50
17.0±n/a nM
Citation
 Canney, DJBlass, BEGao, RAbou-Gharbia, M 5-hydroxytryptamine receptor 7 activity modulators and their method of use US Patent  US10287274 Publication Date 5/14/2019
Target
Name:
5-hydroxytryptamine receptor 7
Synonyms:
5-HT-7 5-HT7 5-HT7S 5HT7 HTR7 | Serotonin receptor 7
Type:
G Protein-Coupled Receptor (GPCR)
Mol. Mass.:
53573.08
Organism:
Homo sapiens (Human)
Description:
P34969
Residue:
479
  
Inhibitor
Name:
BDBM352240
Synonyms:
US10239868, Entry 42 US10676464, Entry 42 | US9802924, Entry 42
Type:
Small organic molecule
Emp. Form.:
C24H35N3O3
Mol. Mass.:
413.553
SMILES:
O=C1OC(CCN2CCN(CC2)c2ccccc2N2CCOCC2)CC11CCCC1
: