Target
C-X-C chemokine receptor type 2
Ligand
BDBM385552
Substrate
Meas. Tech.
In Vitro Affinity
IC50
>20±n/a nM
Citation
 Musicki, BBhurruth-Alcor, Y Chemokine CXCR1 and CXCR2 receptor antagonist compounds, and use thereof in the treatment of chemokine-mediated pathologies US Patent  US10287278 Publication Date 5/14/2019 
Target
Name:
C-X-C chemokine receptor type 2
Synonyms:
C-X-C chemokine receptor type 2 (CXCR-2) CD_antigen=CD182 CXCR-2 CXCR2_HUMAN GRO/MGSA receptor IL-8 receptor type 2 IL8RB | Interleukin-8 receptor B
Type:
Protein
Mol. Mass.:
40767.88
Organism:
Homo sapiens (Human)
Description:
P25025
Residue:
360
  
Inhibitor
Name:
BDBM385552
Synonyms:
US10287278, Example 14 US10647706, Example 15
Type:
Small organic molecule
Emp. Form.:
C20H22N4O4S
Mol. Mass.:
414.478
SMILES:
CC[C@@H](Nc1c(Nc2cccc(c2O)S(C)(=O)=NC)c(=O)c1=O)c1ccccn1
: