Target
C-X-C chemokine receptor type 1
Ligand
BDBM385556
Substrate
Meas. Tech.
In Vitro Affinity
IC50
>200±n/a nM
Citation
 Musicki, BBhurruth-Alcor, Y Chemokine CXCR1 and CXCR2 receptor antagonist compounds, and use thereof in the treatment of chemokine-mediated pathologies US Patent  US10287278 Publication Date 5/14/2019 
Target
Name:
C-X-C chemokine receptor type 1
Synonyms:
C-X-C chemokine receptor type 1 (CXCR-1) CMKAR1 CXCR1_HUMAN Interleukin-8 receptor A | Interleukin-8 receptors, CXCR1/CXCR2
Type:
Enzyme
Mol. Mass.:
39803.83
Organism:
Homo sapiens (Human)
Description:
P25024
Residue:
350
  
Inhibitor
Name:
BDBM385556
Synonyms:
US10287278, Example 18 US10647706, Example 19
Type:
Small organic molecule
Emp. Form.:
C17H23N3O4S
Mol. Mass.:
365.447
SMILES:
CCC(CC)Nc1c(Nc2cccc(c2O)S(C)(=O)=NC)c(=O)c1=O
: