Target
Polyunsaturated fatty acid lipoxygenase ALOX15
Ligand
BDBM385563
Substrate
Meas. Tech.
Lipoxygenase UV-Vis Assay
IC50
730±n/a nM
Citation
 Van Leyen, KJHolman, TRMaloney, DJJadhav, ASimeonov, ARai, G Inhibitors of human 12/15-lipoxygenase US Patent  US10287279 Publication Date 5/14/2019 
Target
Name:
Polyunsaturated fatty acid lipoxygenase ALOX15
Synonyms:
15-Lipoxygenase-1 (15-LOX-1) Arachidonate 15-lipoxygenase LOG15 Reticulocyte 15-lipoxygenase-1 | Sphingosine 1-phosphate receptor 1 (S1P1)
Type:
Protein
Mol. Mass.:
74804.05
Organism:
Homo sapiens (Human)
Description:
Residue:
662
  
Inhibitor
Name:
BDBM385563
Synonyms:
US10287279, Compound 5
Type:
Small organic molecule
Emp. Form.:
C14H12N4O
Mol. Mass.:
252.2713
SMILES:
CNC1OC(=NC1C#N)c1ccc2cnccc2c1
: