Target
Polyunsaturated fatty acid lipoxygenase ALOX15
Ligand
BDBM385593
Substrate
Meas. Tech.
Lipoxygenase UV-Vis Assay
IC50
5400±n/a nM
Citation
 Van Leyen, KJHolman, TRMaloney, DJJadhav, ASimeonov, ARai, G Inhibitors of human 12/15-lipoxygenase US Patent  US10287279 Publication Date 5/14/2019 
Target
Name:
Polyunsaturated fatty acid lipoxygenase ALOX15
Synonyms:
15-Lipoxygenase-1 (15-LOX-1) Arachidonate 15-lipoxygenase LOG15 Reticulocyte 15-lipoxygenase-1 | Sphingosine 1-phosphate receptor 1 (S1P1)
Type:
Protein
Mol. Mass.:
74804.05
Organism:
Homo sapiens (Human)
Description:
Residue:
662
  
Inhibitor
Name:
BDBM385593
Synonyms:
US10287279, Compound 35
Type:
Small organic molecule
Emp. Form.:
C13H13N3O
Mol. Mass.:
227.2618
SMILES:
CNC1NN=C(O1)c1cccc2ccccc12
: