Target
Prolyl hydroxylase EGLN2
Ligand
BDBM50239889
Substrate
Meas. Tech.
PHD1 Enzyme Assay
IC50
13.0±n/a nM
Citation
 Ahmed, SBarker, GCanning, HDavenport, RHarrison, DJenkins, KLivermore, DWright, SKinsella, N Compounds US Patent  US10287286 Publication Date 5/14/2019 
Target
Name:
Prolyl hydroxylase EGLN2
Synonyms:
EGLN2 EIT6 Estrogen-induced tag 6 HIF-PH1 HPH-3 PHD1 Prolyl hydroxylase domain-containing protein 1 (PHD1)
Type:
Protein
Mol. Mass.:
43657.01
Organism:
Homo sapiens (Human)
Description:
Q96KS0
Residue:
407
  
Inhibitor
Name:
BDBM50239889
Synonyms:
CHEMBL4072842 | US10287286, Example 100
Type:
Small organic molecule
Emp. Form.:
C13H9N5
Mol. Mass.:
235.2441
SMILES:
Nc1cc(-c2ccc(cc2)C#N)n2ncnc2c1
: