Target
Baculoviral IAP repeat-containing protein 3 [238-349]
Ligand
BDBM26207
Substrate
Smac-derived peptide
Meas. Tech.
Fluorescence Polarization Assay
pH
7.5±n/a
Temperature
295.15±n/a K
Ki
4.2±1.1 nM
Citation
 Zhang, BNikolovska-Coleska, ZZhang, YBai, LQiu, SYang, CYSun, HWang, SWu, Y Design, Synthesis, and Evaluation of Tricyclic, Conformationally Constrained Small-Molecule Mimetics of Second Mitochondria-Derived Activator of Caspases. J Med Chem 51:7352-5 (2008)  
Target
Name:
Baculoviral IAP repeat-containing protein 3 [238-349]
Synonyms:
API2 BIRC3 Baculoviral IAP repeat-containing protein 3 Inhibitor of apoptosis protein 1 RNF49 cIAP-2 BIR3
Type:
BIR3 domain
Mol. Mass.:
12945.93
Organism:
Homo sapiens (Human)
Description:
Human cIAP2 BIR3 domain (residues 238-349) was used in binding assays.
Residue:
112
  
Inhibitor
Name:
BDBM26207
Synonyms:
(2R,5S,8S)-8-[(2S)-2-(methylamino)propanamido]-7-oxo-N-[(1R)-1,2,3,4-tetrahydronaphthalen-1-yl]-6-azatricyclo[8.4.0.0^{2,6}]tetradeca-1(10),11,13-triene-5-carboxamide | WS-5
Type:
Small organic molecule
Emp. Form.:
C28H34N4O3
Mol. Mass.:
474.5946
SMILES:
CN[C@@H](C)C(=O)N[C@H]1Cc2ccccc2[C@H]2CC[C@H](N2C1=O)C(=O)N[C@@H]1CCCc2ccccc12
:
Substrate
Name:
Smac-derived peptide
Synonyms:
SM5F
Type:
fluorescently labelled peptide
Mol. Mass.:
1220.95
Organism:
Description:
5-carboxyfluorescein was coupled to the lysine side chain of the mutated Smac peptide.
Residue:
10
ARPFKFAMNH