Target
Adenosine receptor A2a
Ligand
BDBM26243
Substrate
BDBM21190
Meas. Tech.
Receptor Binding Assay
pH
7.4±n/a
Temperature
295.15±n/a K
Ki
7.8±1.8 nM
Citation
 Zhang, XTellew, JELuo, ZMoorjani, MLin, ELanier, MCChen, YWilliams, JPSaunders, JLechner, SMMarkison, SJoswig, TPetroski, RPiercey, JKargo, WMalany, SSantos, MGross, RSWen, JJalali, KO'Brien, ZStotz, CECrespo, MIDiaz, JLSlee, DH Lead Optimization of 4-Acetylamino-2-(3,5-dimethylpyrazol-1-yl)-6-pyridylpyrimidines as A2A Adenosine Receptor Antagonists for the Treatment of Parkinson's Disease. J Med Chem 51:7099-7110 (2008)  
Target
Name:
Adenosine receptor A2a
Synonyms:
A2A adenosine receptor (hA2A) ADENOSINE A2 ADORA2 Adenosine A2A receptor (A2AAR)
Type:
G Protein-Coupled Receptor (GPCR)
Mol. Mass.:
44716.46
Organism:
Homo sapiens (Human)
Description:
P29274
Residue:
412
  
Inhibitor
Name:
BDBM26243
Synonyms:
ethyl N-[2-(3,5-dimethyl-1H-pyrazol-1-yl)-6-(5-methoxypyridin-3-yl)pyrimidin-4-yl]carbamate | pyrazolylpyrimidine derivative, 9d
Type:
Small organic molecule
Emp. Form.:
C18H20N6O3
Mol. Mass.:
368.3898
SMILES:
CCOC(=O)Nc1cc(nc(n1)-n1nc(C)cc1C)-c1cncc(OC)c1
:
Substrate
Name:
BDBM21190
Synonyms:
4-(2-{[5-amino-2-(furan-2-yl)-[1,2,4]triazolo[1,5-a][1,3,5]triazin-7-yl]amino}ethyl)phenol ZM 241385 [3H]-ZM241385
Type:
Small organic molecule
Emp. Form.:
C16H15N7O2
Mol. Mass.:
337.336
SMILES:
Nc1nc(NCCc2ccc(O)cc2)nc2nc(nn12)-c1ccco1
: