Target
Adenosine receptor A1
Ligand
BDBM26257
Substrate
BDBM21173
Meas. Tech.
Receptor Binding Assay
Ki
470±n/a nM
Citation
 Zhang, XTellew, JELuo, ZMoorjani, MLin, ELanier, MCChen, YWilliams, JPSaunders, JLechner, SMMarkison, SJoswig, TPetroski, RPiercey, JKargo, WMalany, SSantos, MGross, RSWen, JJalali, KO'Brien, ZStotz, CECrespo, MIDiaz, JLSlee, DH Lead Optimization of 4-Acetylamino-2-(3,5-dimethylpyrazol-1-yl)-6-pyridylpyrimidines as A2A Adenosine Receptor Antagonists for the Treatment of Parkinson's Disease. J Med Chem 51:7099-7110 (2008)  
Target
Name:
Adenosine receptor A1
Synonyms:
A1 adenosine receptor (hA1) AA1R_HUMAN ADORA1 Adenosine A1-receptor Adenosine receptor A1 (hA1) | Adenosine transporter (AdT)
Type:
G Protein-Coupled Receptor (GPCR)
Mol. Mass.:
36520.92
Organism:
Homo sapiens (Human)
Description:
P30542
Residue:
326
  
Inhibitor
Name:
BDBM26257
Synonyms:
N-[2-(3,5-dimethyl-1H-pyrazol-1-yl)-6-[6-(4-hydroxypiperidin-1-yl)pyridin-2-yl]pyrimidin-4-yl]acetamide | pyrazolylpyrimidine derivative, 16k
Type:
Small organic molecule
Emp. Form.:
C21H25N7O2
Mol. Mass.:
407.4689
SMILES:
CC(=O)Nc1cc(nc(n1)-n1nc(C)cc1C)-c1cccc(n1)N1CCC(O)CC1
:
Substrate
Name:
BDBM21173
Synonyms:
1,3-dipropyl-8-cyclopentylxanthine CHEMBL183 PD116948 | [3H]DPCPX
Type:
radiolabeled ligand
Emp. Form.:
C16H24N4O2
Mol. Mass.:
304.3874
SMILES:
CCCn1c2nc([nH]c2c(=O)n(CCC)c1=O)C1CCCC1
: