Target
Atypical chemokine receptor 3
Ligand
BDBM385614
Substrate
Meas. Tech.
Serum Binding Analysis
IC50
<500±n/a nM
Citation
 Fan, JKrasinski, ALange, CWLui, RMMcMahon, JPPowers, JPZeng, YZhang, P CXCR7 antagonists US Patent  US10287292 Publication Date 5/14/2019 
Target
Name:
Atypical chemokine receptor 3
Synonyms:
ACKR3 C-X-C chemokine receptor type 7 CMKOR1 CXCR-7 Chemokine orphan receptor 1 G-protein coupled receptor RDC1 homolog RDC-1 | RDC1
Type:
Enzyme
Mol. Mass.:
41498.84
Organism:
Homo sapiens (Human)
Description:
P25106
Residue:
362
  
Inhibitor
Name:
BDBM385614
Synonyms:
US10287292, Compound 1.014 | US11059825, Compound 1.014
Type:
Small organic molecule
Emp. Form.:
C19H16F2N8O
Mol. Mass.:
410.3801
SMILES:
Fc1ccc(cc1F)-n1cnc(n1)C(=O)N[C@H]1CCN(C1)c1nccn2ccnc12
: