Target
Atypical chemokine receptor 3
Ligand
BDBM385631
Substrate
Meas. Tech.
Serum Binding Analysis
IC50
<500±n/a nM
Citation
 Fan, JKrasinski, ALange, CWLui, RMMcMahon, JPPowers, JPZeng, YZhang, P CXCR7 antagonists US Patent  US10287292 Publication Date 5/14/2019 
Target
Name:
Atypical chemokine receptor 3
Synonyms:
ACKR3 C-X-C chemokine receptor type 7 CMKOR1 CXCR-7 Chemokine orphan receptor 1 G-protein coupled receptor RDC1 homolog RDC-1 | RDC1
Type:
Enzyme
Mol. Mass.:
41498.84
Organism:
Homo sapiens (Human)
Description:
P25106
Residue:
362
  
Inhibitor
Name:
BDBM385631
Synonyms:
US10287292, Compound 1.025 | US11059825, Compound 1.025
Type:
Small organic molecule
Emp. Form.:
C20H24N6OS
Mol. Mass.:
396.509
SMILES:
Cc1cn2cccc2c(n1)N1CC[C@@H](C1)NC(=O)c1csc(n1)N1CCCC1
: